#,Annotated Sequence,Modifications,Contaminant,Qvality PEP,Qvality q-value,# Protein Groups,# Proteins,# PSMs,Master Protein Accessions,Positions in Master Proteins,Master Protein Descriptions,Protein Accessions,# Missed Cleavages,Theo. MH+ [Da],Abundances (Normalized) Ratio: (Disease) / (Control),Abundances (Normalized) Ratio (log2): (Disease) / (Control),Abundances (Normalized) Ratio P-Value: (Disease) / (Control),Abundances (Normalized) Ratio Adj. P-Value: (Disease) / (Control),Abundances (Normalized) Fold Change: (Disease) / (Control),Confidence,Abundances (Normalized) (Grouped): Control,Abundances (Normalized) (Grouped): Disease,Abundances (Normalized) (Grouped) CV [%]: Control,Abundances (Normalized) (Grouped) CV [%]: Disease,Abundances (Grouped) Count: Control,Abundances (Grouped) Count: Disease,"Abundances (Normalized): F1: Sample, Control","Abundances (Normalized): F2: Sample, Control","Abundances (Normalized): F3: Sample, Control","Abundances (Normalized): F4: Sample, Control","Abundances (Normalized): F5: Sample, Control","Abundances (Normalized): F6: Sample, Control","Abundances (Normalized): F7: Sample, Control","Abundances (Normalized): F8: Sample, Disease","Abundances (Normalized): F9: Sample, Disease","Abundances (Normalized): F10: Sample, Disease","Abundances (Normalized): F11: Sample, Disease","Abundances (Normalized): F12: Sample, Disease","Abundances (Normalized): F13: Sample, Disease","Abundance: F1: Sample, Control","Abundance: F2: Sample, Control","Abundance: F3: Sample, Control","Abundance: F4: Sample, Control","Abundance: F5: Sample, Control","Abundance: F6: Sample, Control","Abundance: F7: Sample, Control","Abundance: F8: Sample, Disease","Abundance: F9: Sample, Disease","Abundance: F10: Sample, Disease","Abundance: F11: Sample, Disease","Abundance: F12: Sample, Disease","Abundance: F13: Sample, Disease","Abundances Count: F1: Sample, Control","Abundances Count: F2: Sample, Control","Abundances Count: F3: Sample, Control","Abundances Count: F4: Sample, Control","Abundances Count: F5: Sample, Control","Abundances Count: F6: Sample, Control","Abundances Count: F7: Sample, Control","Abundances Count: F8: Sample, Disease","Abundances Count: F9: Sample, Disease","Abundances Count: F10: Sample, Disease","Abundances Count: F11: Sample, Disease","Abundances Count: F12: Sample, Disease","Abundances Count: F13: Sample, Disease",Quan Info,Charge,DeltaScore,DeltaCn,Rank,DeltaM [ppm],Percolator q-Value,Percolator PEP,Xcorr,Top Apex RT [min],Abundance Ratio: (Disease) / (Control),Abundance Ratio (log2): (Disease) / (Control),Abundance Ratio P-Value: (Disease) / (Control),Abundance Ratio Adj. P-Value: (Disease) / (Control),Abundances Fold Change: (Disease) / (Control),Confidence.1,Abundances (Grouped): Control,Abundances (Grouped): Disease,Abundances (Grouped) CV [%]: Control,Abundances (Grouped) CV [%]: Disease
709,[K].SSSYSKQF.[T],,False,0.0417102,0.00160737,1,2,1,P02671,P02671 [576-583],Fibrinogen alpha chain OS=Homo sapiens OX=9606 GN=FGA PE=1 SV=2,P02671; P02671-2,0,933.43124,13.761,3.78,0.121437259472992,0.161146781582032,13.761,Low,586742.745814109,8073944.85390677,75.91,37.7,2,6,1068682.45619739,,322141.575141468,,,,,12532620.0618242,3798109.1120372,11400009.5448502,8261624.88659503,7890528.36442622,6683104.98020806,52228.6015625,,26651.69921875,,,,,1554665.125,175643.46875,1100476.0,2904419.0,514037.53125,535289.9375,1.0,,1.0,,,,,1.0,1.0,1.0,1.0,1.0,1.0,,2,0.3605,0,1,0.09,0.0009223,0.00964,1.72,38.61,20.572,4.36,0.00375324552732257,0.0135039452477895,20.572,High,37309.2613094884,767511.387055756,45.86,88.2
1172,[N].YDAAKRGPGGA.[W],,False,0.0969172,0.00547755,1,7,3,P0DJI9,P0DJI9 [60-70],Serum amyloid A-2 proteincur OS=Homo sapiens OX=9606 GN=SAA2 PE=1 SV=1,E9PR14; P0DJI9; E9PQD6; A0A096LPE2; P0DJI9-2; A0A3B3ISW8; G3V1D9,0,1062.53268,100.0,6.64,0.000804010465374249,0.00364415133007289,100.0,High,16933.060546875,2725733.06856124,94.94,157.75,3,6,,,,16933.060546875,60897.9893033261,9709.25364227465,,973676.477593348,6688738.24906324,3460103.43179285,31111678.5770762,466441.920345006,2147225.04904966,,,,16933.060546875,24659.52734375,6549.24951171875,,120784.0703125,309320.546875,334013.82421875,10937479.203125,30386.89453125,171984.125,,,,1.0,1.0,1.0,,1.0,2.0,2.0,2.0,1.0,1.0,,2,0.1349,0,1,0.99,0.002328,0.03025,1.26,28.73,13.621,3.77,0.0117773834132399,0.0366017546044451,13.621,High,16933.060546875,230647.401023333,56.63,221.16
395,[R].EEAPSLRPAPPPISGGGY.[R],,False,3.21694e-05,0.0013942,1,1,21,P02675,P02675 [54-71],Fibrinogen beta chain OS=Homo sapiens OX=9606 GN=FGB PE=1 SV=2,P02675,0,1794.90209,26.312,4.72,8.73896641160706e-05,0.000910391210560305,26.312,High,225835.247894294,5942149.34030453,81.97,53.28,6,6,,101638.054835427,533173.489398947,115161.671875,440272.803001957,115840.812432038,796233.099468344,4362095.73056387,10397490.6971364,8094535.50848992,2291861.80492164,3628103.25975039,9671290.46931535,,66661.421875,44110.9765625,115161.671875,178280.421875,78138.8984375,108966.765625,541115.75,480831.71875,781389.0,805716.4375,236356.953125,774631.625,,1.0,1.0,1.0,1.0,1.0,1.0,1.0,1.0,1.0,1.0,1.0,1.0,,2,0.5394,0,1,0.85,0.0004186,6.559e-07,3.43,68.89,7.016,2.81,6.0580656641029e-05,0.000749369378805351,7.016,High,92274.2815319347,647429.820703058,47.89,37.47
89,[R].GDSTFESKSYKM.[A],1xOxidation [M12],False,0.00497614,0.0013942,1,2,10,P02671,P02671 [592-603],Fibrinogen alpha chain OS=Homo sapiens OX=9606 GN=FGA PE=1 SV=2,P02671; P02671-2,0,1395.60967,18.555,4.21,7.50602861920621e-06,0.000246832780423327,18.555,High,685602.028713454,12721061.5487256,57.48,38.23,6,5,,264213.669976639,595245.718322105,789674.125,1198379.55580616,1371291.75879862,391300.206736829,20399579.5614254,,20817020.321786,12721061.5487256,11903851.2997428,7939754.31921785,,173290.00390625,49246.390625,789674.125,485261.890625,924986.84375,53550.546875,2530557.4375,,2009527.375,4472158.125,775490.0625,635942.515625,,2.0,2.0,2.0,2.0,2.0,2.0,2.0,,2.0,2.0,2.0,2.0,,3,0.5481,0,1,0.55,0.0004186,0.0005516,2.7,35.44,6.93,2.79,0.0163513112590854,0.0483610816052612,6.93,High,289984.542556945,2009527.375,92.48,74.76
1145,[V].LTIDEKGTE.[A],,False,0.0893404,0.00507189,1,4,1,A0A024R6I7,A0A024R6I7 [362-370],Alpha-1-antitrypsin OS=Homo sapiens OX=9606 GN=SERPINA1 PE=1 SV=1,A0A024R6I7; P01009; P20848; A0A0G2JPK4,0,1005.50988,17.576,4.14,0.0038193239421356,0.0119012862125475,17.576,High,27517.6913722093,483656.418980114,97.9,50.0,5,5,123259.126330396,16052.8199622081,122545.325959282,8210.7470703125,,27517.6913722093,,483656.418980114,,394288.130784054,1178466.57998538,476940.730309336,966761.636235074,6023.91455078125,10528.57421875,10138.52734375,8210.7470703125,,18561.697265625,,59997.33203125,,38061.77734375,414296.3125,31070.8515625,77433.734375,1.0,1.0,1.0,1.0,,1.0,,1.0,,1.0,1.0,1.0,1.0,,2,0.1461,0,1,1.09,0.00226,0.02722,1.78,41.26,5.918,2.57,0.00869269842848423,0.0286202995428396,5.918,High,10138.52734375,59997.33203125,44.41,131.44
1100,[P].GKEGPPGTKGNQGPSGP.[Q],,False,0.0790318,0.00382587,1,16,1,A0A140T9N1,A0A140T9N1 [608-624],Collagen alpha-2(XI) chain OS=Homo sapiens OX=9606 GN=COL11A2 PE=1 SV=1,P13942-2; P13942-8; A0A140T9N1; A0A140TA43; A0A0C4DFS1; Q4VXY6; A0A140T9I7; P13942-5; A0A140TA54; P13942-7; P13942-4; P13942-6; P13942-3; A0A0G2JL35; P13942; H0YIS1,0,1564.77141,25.66,4.68,0.000291931694831792,0.00188674373141288,25.66,High,83213.9449022398,2135266.37632359,88.73,29.55,6,6,120744.503583848,25324.9707966689,317936.281798988,43055.2265625,,57348.8682355171,214306.833132245,1427303.07864659,2765534.30120759,1579521.53407584,2420751.51200532,1883449.19965832,2988671.42945182,5901.02001953125,16609.90625,26303.783203125,43055.2265625,,38683.92578125,29328.5,177056.21875,127892.0703125,152475.796875,851028.3125,122699.4609375,239380.609375,1.0,1.0,1.0,1.0,,1.0,1.0,1.0,1.0,1.0,1.0,1.0,1.0,,3,0.096,0,1,0.65,0.001737,0.02299,1.77,35.88,5.916,2.56,0.000342131332966678,0.00213221134295305,5.916,High,27774.9978518964,164306.993294809,51.8,101.9
353,[S].DSQDLGQHGLEED.[F],,False,0.00584959,0.0013942,1,1,3,P10124,P10124 [143-155],Serglycin OS=Homo sapiens OX=9606 GN=SRGN PE=1 SV=3,P10124,0,1442.60301,25.224,4.66,3.94327456057366e-06,0.000189010642823227,25.224,High,259105.404181362,6535789.95062409,43.2,14.81,6,5,,168461.773207008,288687.994804074,102826.25,232554.216608663,338313.352498283,402326.078106835,7161990.35692794,5134476.2065104,7770819.45446474,,6498709.22283483,6535789.95062409,,110489.140625,23883.98828125,102826.25,94168.578125,228204.828125,55059.46875,888441.25,237443.734375,750139.75,,423365.875,523490.59375,,1.0,1.0,1.0,1.0,1.0,1.0,1.0,1.0,1.0,,1.0,1.0,,2,0.5585,0,1,0.72,0.0004186,0.0006848,2.99,43.76,5.32,2.41,0.00120754730051904,0.00585325010946035,5.32,High,98402.2446716831,523490.59375,68.15,45.84
125,[K].SSSYSKQFT.[S],,False,0.0125786,0.0013942,1,2,1,P02671,P02671 [576-584],Fibrinogen alpha chain OS=Homo sapiens OX=9606 GN=FGA PE=1 SV=2,P02671; P02671-2,0,1034.47892,23.336,4.54,1.38723292504019e-05,0.000310964456239634,23.336,High,75496.1199312334,1761763.47168602,56.39,47.33,5,6,213508.044305082,72614.0293725063,,,75496.1199312334,65500.8504127543,124945.28031813,2657673.16279278,649342.227342401,2390780.23370885,1906870.22856919,1627698.87728337,896349.055883432,10434.5556640625,47625.4140625,,,30570.7734375,44182.73828125,17099.1171875,329683.0,30028.81640625,230788.953125,670370.5625,106038.3125,71793.96875,1.0,1.0,,,1.0,1.0,1.0,1.0,1.0,1.0,1.0,1.0,1.0,,2,0.4892,0,1,0.13,0.0004186,0.00191,2.31,38.45,5.117,2.36,0.0113411878648283,0.0359824960438644,5.117,High,30570.7734375,156436.795968904,54.33,99.34
870,[P].GEVPGEGPPGP.[G],,False,0.0482189,0.00160737,1,1,7,Q15569,Q15569 [16-26],Dual specificity testis-specific protein kinase 1 OS=Homo sapiens OX=9606 GN=TESK1 PE=1 SV=2,Q15569,0,992.46835,11.464,3.52,0.00279085357111178,0.00945638734289333,11.464,High,663335.450185939,7604502.32814171,99.68,75.06,7,6,2879407.9367825,226830.700070646,1703752.85628265,145001.484375,663335.450185939,194535.165483771,1345488.09600282,7296396.39134052,19224322.9764109,3793836.99813661,1089116.78038761,7925618.69683291,11955695.4437099,140722.296875,148771.609375,140956.375,145001.484375,268605.5625,131221.140625,184133.875,905114.25,889028.375,366230.09375,382884.90625,516323.53125,957603.3125,1.0,1.0,1.0,1.0,1.0,1.0,1.0,1.0,1.0,1.0,1.0,1.0,1.0,,2,0.194,0,1,0.39,0.0009223,0.01165,2.68,41.42,4.672,2.22,0.000229957465584744,0.00157363049978579,4.672,High,145001.484375,677514.774718197,29.24,41.41
1001,[M].PEPAKSAPAPKKG.[S],,False,0.0260207,0.00160737,1,5,6,Q16778,Q16778 [2-14],Histone H2B type 2-E OS=Homo sapiens OX=9606 GN=H2BC21 PE=1 SV=3,Q16778; O60814; P62807; P57053; P06899,0,1277.72121,10.187,3.35,5.6137708032589e-05,0.000753540773206675,10.187,High,661997.959359057,6743741.01699541,58.71,64.15,7,6,977367.465184161,241991.224537182,1249569.46592321,281437.59375,884000.663839046,351297.840198865,661997.959359057,6828674.29449132,4985993.86449549,7695597.04451729,1997775.52616297,16129224.8566789,6659864.11754817,47765.859375,158714.953125,103380.4765625,281437.59375,357959.90625,236963.34375,90596.3046875,847093.5625,230577.171875,742878.3125,702328.8125,1050756.875,533428.4375,1.0,1.0,1.0,1.0,1.0,1.0,1.0,1.0,1.0,1.0,1.0,1.0,1.0,,3,0.5736,0,1,0.2,0.0009223,0.005067,1.97,27.0,4.551,2.19,0.00183296383439708,0.00830784906759196,4.551,High,158714.953125,722319.072882704,62.09,40.97
927,[AV].EDPQGDAAQKTDTSHH.[D],,False,0.0201034,0.00160737,1,10,5,A0A024R6I7,A0A024R6I7 [25-40],Alpha-1-antitrypsin OS=Homo sapiens OX=9606 GN=SERPINA1 PE=1 SV=1,G3V387; P01009-3; G3V544; A0A024R6I7; A0A0G2JRN3; P01009; G3V5R8; P20848; P01009-2; A0A0B4J278,0,1736.74704,16.237,4.02,8.05095675962267e-05,0.000878057471596347,16.237,High,1440638.61082158,23392358.6769363,78.27,46.67,7,6,3832554.62377078,831285.44108495,4187179.18063282,1021189.296875,1440638.61082158,840701.236846004,5759153.79049688,23650354.9719277,25392419.2086169,23137176.8043207,8511204.84672799,17904675.7777728,41862245.3119863,187304.439453125,545215.76171875,346417.37890625,1021189.296875,583360.265625,567083.9765625,788156.5859375,2933814.46875,1174271.84375,2233498.8125,2992160.1875,1166420.6640625,3352998.15625,2.0,2.0,2.0,2.0,2.0,2.0,2.0,2.0,2.0,2.0,2.0,2.0,2.0,,3,0.4773,0,1,0.46,0.0009223,0.003589,1.76,26.84,4.514,2.17,0.000445552872756983,0.00268099918262392,4.514,High,567083.9765625,2559818.57404943,47.36,41.3
1017,[M].PDPAKSAPAPK.[K],,False,0.0553401,0.00160737,1,4,2,Q5QNW6,Q5QNW6 [2-12],Histone H2B type 2-F OS=Homo sapiens OX=9606 GN=H2BC18 PE=1 SV=3,Q5QNW6; Q93079; Q5QNW6-2; P23527,0,1078.58914,7.337,2.88,0.000328114585313751,0.00196107063235887,7.337,High,173118.038197247,1270216.33947305,70.68,74.09,7,6,529994.130275107,53599.0866322985,426316.927255755,134222.046875,173118.038197247,128472.002170084,285755.3553224,1621569.54666282,4360917.19479068,783374.667173766,948264.076801198,2298228.49404765,994992.507342522,25901.849609375,35154.0703125,35270.42578125,134222.046875,70100.984375,86659.1015625,39106.43359375,201154.875,201670.515625,75621.4296875,333367.375,149720.734375,79694.9140625,1.0,1.0,1.0,1.0,1.0,1.0,1.0,1.0,1.0,1.0,1.0,1.0,1.0,,2,0.4062,0,1,1.04,0.0009223,0.01415,1.28,30.08,4.438,2.15,0.00747838649815237,0.0250957393062998,4.438,High,39106.43359375,173542.662213392,64.08,55.31
867,[T].KEVVTSED.[G],,False,0.0621961,0.00160737,1,2,1,P02671,P02671 [480-487],Fibrinogen alpha chain OS=Homo sapiens OX=9606 GN=FGA PE=1 SV=2,P02671; P02671-2,0,906.44147,18.413,4.2,0.000101402266077347,0.000983038635027617,18.413,High,102138.87062422,1880660.77201642,103.64,63.6,7,6,548636.276135505,133690.664108901,584687.075739405,70887.8828125,77734.1371167482,63717.7346092177,102138.87062422,3199518.3980122,5246516.41508268,1065778.62454519,2158219.46878173,1397206.90735321,1638797.62487635,26812.927734375,87683.7890625,48372.84375,70887.8828125,31477.017578125,42979.9609375,13977.9951171875,396898.625,242625.03125,102882.703125,758733.75,91022.6484375,131261.125,1.0,1.0,1.0,1.0,1.0,1.0,1.0,1.0,1.0,1.0,1.0,1.0,1.0,,2,0.1244,0,1,0.19,0.0009223,0.01647,2.09,29.88,4.152,2.05,0.00282612413556925,0.0117025340568891,4.152,High,42979.9609375,178457.934973582,55.93,89.86
1153,[T].VGGTGGIGGVGGTGGVGNRAPR.[E],,False,0.0905626,0.00507189,1,2,1,Q13201,Q13201 [159-180],Multimerin-1 OS=Homo sapiens OX=9606 GN=MMRN1 PE=1 SV=3,Q13201-2; Q13201,0,1852.97363,20.79,4.38,0.0110253823772078,0.0267212392336494,20.79,High,192705.101958915,4006301.24033487,57.11,22.37,3,3,,,,62263.4375,249665.396325169,192705.101958915,,4006301.24033487,,4182527.01330814,,,2697019.82760234,,,,62263.4375,101097.4375,129986.6953125,,496979.625,,403751.46875,,,216020.484375,,,,1.0,1.0,1.0,,1.0,,1.0,,,1.0,,3,0.4219,0,1,-0.08,0.00226,0.02772,1.92,46.7,3.994,2.0,0.0167974590994152,0.0488526102141326,3.994,High,101097.4375,403751.46875,34.75,38.44
586,[V].TKEVVTSED.[G],,False,0.0174812,0.0013942,1,2,2,P02671,P02671 [479-487],Fibrinogen alpha chain OS=Homo sapiens OX=9606 GN=FGA PE=1 SV=2,P02671; P02671-2,0,1007.48915,23.212,4.54,0.000450001886942068,0.00245391653973096,23.212,High,376574.679170079,8741105.959316,94.67,32.02,7,6,2106332.92828423,271221.928981345,2354999.58876438,248782.8125,376574.679170079,199303.830908456,1448060.06326776,9497919.95550136,14310052.7797818,6849308.51367831,8694437.87056474,6060422.56689458,8788024.54275595,102940.609375,177886.515625,194835.890625,248782.8125,152487.03125,134437.78125,198171.140625,1178212.125,661768.0625,661183.625,3056576.75,394813.1875,703885.5625,1.0,1.0,1.0,1.0,1.0,1.0,1.0,1.0,1.0,1.0,1.0,1.0,1.0,,2,0.2586,0,1,0.82,0.0004186,0.00297,2.32,31.24,3.837,1.94,0.00137605443757101,0.00657867121523674,3.837,High,177886.515625,682502.003599512,27.65,88.98
1169,[AV].EDPQGDAAQKTDTSHHD.[Q],,False,0.0936885,0.00547755,1,10,1,A0A024R6I7,A0A024R6I7 [25-41],Alpha-1-antitrypsin OS=Homo sapiens OX=9606 GN=SERPINA1 PE=1 SV=1,G3V387; P01009-3; G3V544; A0A024R6I7; A0A0G2JRN3; P01009; G3V5R8; P20848; P01009-2; A0A0B4J278,0,1851.77399,11.994,3.58,5.1002631748896e-05,0.000711996739214589,11.994,High,548473.260222322,6578353.49069598,81.18,56.68,7,6,905237.093079892,314008.063504259,1138359.1422153,381956.0625,548473.260222322,303544.241871779,2146909.36397852,6587565.8865558,6569153.97793121,7253690.07001754,2740264.258435,5421031.35089421,15005984.5380204,44240.70703125,205948.6875,94179.7265625,381956.0625,222094.21875,204751.78125,293810.65625,817184.1875,303790.375,700219.75,963354.75,353159.3125,1201919.25,1.0,1.0,1.0,1.0,1.0,1.0,1.0,1.0,1.0,1.0,1.0,1.0,1.0,,3,0.0928,0,1,-0.11,0.002328,0.02888,0.97,27.1,3.673,1.88,0.00369005636399968,0.0134148924066238,3.673,High,205948.6875,756444.649313618,55.02,48.25
411,[AV].EDPQGDAAQKTDTSH.[H],,False,0.007749,0.0013942,1,10,3,A0A024R6I7,A0A024R6I7 [25-39],Alpha-1-antitrypsin OS=Homo sapiens OX=9606 GN=SERPINA1 PE=1 SV=1,G3V387; P01009-3; G3V544; A0A024R6I7; A0A0G2JRN3; P01009; G3V5R8; P20848; P01009-2; A0A0B4J278,0,1599.68813,19.462,4.28,0.00187756243010574,0.0070205066381247,19.462,High,637179.804432645,12400559.3444592,103.41,57.82,7,6,6781536.86711216,637179.804432645,3612143.60168068,538856.75,596923.172757173,501495.570719095,4303768.28356554,12605375.2985592,20804120.2246255,12199071.3019891,3711473.86404965,10658311.4316608,27868001.0562936,331426.96875,417907.5625,298843.03125,538856.75,241713.125,338277.25,588982.9375,1563690.375,962086.0625,1177611.75,1304788.75,694347.9375,2232115.25,1.0,1.0,1.0,1.0,1.0,1.0,1.0,1.0,1.0,1.0,1.0,1.0,1.0,,3,0.5451,0,1,0.66,0.0004186,0.001002,2.33,27.32,3.664,1.87,0.000194848397648983,0.0013877977710101,3.664,High,338277.25,1239570.31396682,32.6,40.46
356,[G].DSTFESKSYKM.[A],1xOxidation [M11],False,0.00389059,0.0013942,1,2,5,P02671,P02671 [593-603],Fibrinogen alpha chain OS=Homo sapiens OX=9606 GN=FGA PE=1 SV=2,P02671; P02671-2,0,1338.58821,9.434,3.24,2.44659808451837e-06,0.000142310455249485,9.434,High,222618.522625214,2100293.0104454,40.39,36.05,6,5,,100288.596296667,266811.441875369,140278.9375,267554.793669762,326943.467989584,185745.432307895,3980665.30258004,,3159402.07787182,1710630.18720205,2100293.0104454,2078901.3684207,,65776.3515625,22074.078125,140278.9375,108341.421875,220535.421875,25419.791015625,493799.5,,304986.25,601381.3125,136826.0,166511.671875,,1.0,1.0,1.0,1.0,1.0,1.0,1.0,,1.0,1.0,1.0,1.0,,2,0.4977,0,1,0.53,0.0004186,0.0003986,2.17,35.8,3.613,1.85,0.0165872506577827,0.0486466426854299,3.613,High,84417.435722907,304986.25,78.42,59.54
838,[K].DDPDAPLQPVTPLQ.[L],,False,0.0236027,0.00160737,1,11,17,F5GXS0,F5GXS0 [1429-1442],C4a anaphylatoxin OS=Homo sapiens OX=9606 GN=C4B PE=1 SV=1,F5GXS0; A0A0G2JL54; A0A140TA32; A0A3B3ISA6; P0C0L4-2; A0A0G2JPR0; P0C0L4; A0A140TA29; P0C0L5; A0A140TA44; A0A140TA49,0,1505.74821,11.061,3.47,0.000387656754292861,0.00214749535314617,11.061,High,1098605.8192454,12151463.4066816,93.74,52.01,7,6,2173898.03840018,404932.378335353,5034216.87619826,387845.90625,705703.704630605,1098605.8192454,3052201.83919034,10749500.0724614,27509163.2849994,16918559.3448895,6403465.50577957,13736272.5641725,10108634.4384502,106242.6484375,265583.28125,416495.244140625,387845.90625,285761.8125,741050.125,417702.5078125,1333470.0,1272160.625,1633197.625,2251173.0,894865.25,809661.125,1.0,1.0,2.0,1.0,1.0,1.0,2.0,1.0,1.0,1.0,1.0,1.0,1.0,,2,0.5325,0,1,0.57,0.0009223,0.004458,1.69,76.57,3.358,1.75,0.000501317767896753,0.00291599834993278,3.358,High,387845.90625,1302454.61672135,52.28,38.69
1257,[M].PEPAKSAPAPK.[K],,False,0.105813,0.00739992,1,5,2,Q16778,Q16778 [2-12],Histone H2B type 2-E OS=Homo sapiens OX=9606 GN=H2BC21 PE=1 SV=3,Q16778; O60814; P62807; P57053; P06899,0,1092.60479,9.66,3.27,0.0005082135034027,0.0026873714043567,9.66,High,477947.32626365,4616767.1575146,88.98,77.18,7,6,2152552.55918948,191111.674042776,2105953.90771448,401102.0625,477947.32626365,431901.755766238,799518.505662829,4703409.10521272,16969310.5051283,4096791.02474822,2436941.52697793,8953053.28756988,4531721.2493982,105199.453125,125344.546875,174231.625,401102.0625,193536.03125,291333.65625,109416.3828125,583455.5,784745.375,395475.125,856720.0,583256.9375,362972.71875,1.0,1.0,1.0,1.0,1.0,1.0,1.0,1.0,1.0,1.0,1.0,1.0,1.0,,2,0.3121,0,1,0.45,0.002692,0.0341,1.41,28.62,3.348,1.74,0.000580752466198986,0.00326907436618461,3.348,High,174231.625,583356.210301674,54.86,33.51
990,[P].PPPPPPLPPPGIRPSSPVTVTAL.[A],,False,0.0265699,0.00160737,1,1,1,Q92558,Q92558 [426-448],Wiskott-Aldrich syndrome protein family member 1 OS=Homo sapiens OX=9606 GN=WASF1 PE=1 SV=1,Q92558,0,2284.30636,3.057,1.61,0.114258122832667,0.153369557186926,3.057,Low,148986.603802226,455471.881963753,70.59,55.9,4,4,183349.216405048,,224182.341264724,7184.74951171875,,,121064.101323916,223499.602900475,835892.470581298,,323776.298968729,640734.469818743,,8960.634765625,,18547.25,7184.74951171875,,,16567.966796875,27725.01171875,38655.828125,,113825.3125,41741.3828125,,1.0,,1.0,1.0,,,1.0,1.0,1.0,,1.0,1.0,,,3,0.456,0,1,-3.74,0.0009223,0.005195,1.93,114.55,3.297,1.72,0.0123885930644665,0.0375966867782506,3.297,High,12184.3957287918,40168.9895279907,43.56,70.93
307,[G].SESGIFTNTKES.[S],,False,0.000828358,0.0013942,1,2,4,P02671,P02671 [549-560],Fibrinogen alpha chain OS=Homo sapiens OX=9606 GN=FGA PE=1 SV=2,P02671; P02671-2,0,1299.6063,18.795,4.23,7.01846474234975e-05,0.000844635929337953,18.795,High,393160.474588641,7389627.24432572,88.79,56.59,6,6,,205844.070104964,1005776.09906556,385377.0,401101.152322961,338682.656813566,1805894.92190432,20644297.4158858,6739610.20133329,8013246.83781583,9913547.22469336,6814539.96305012,6259293.99123404,,135007.09375,83210.75,385377.0,162418.578125,228453.9375,247141.859375,2560914.5625,311673.119140625,773541.96875,3485161.25,443941.03125,501344.375,,1.0,1.0,1.0,1.0,1.0,1.0,2.0,2.0,2.0,1.0,1.0,1.0,,2,0.2394,0,1,2.03,0.0004186,5.016e-05,2.59,47.2,3.233,1.69,0.00984891885996737,0.0318265989085983,3.233,High,192627.006662637,622744.662650141,51.32,99.54
837,[K].DDPDAPLQPVTPLQL.[F],,False,0.0648092,0.00160737,1,11,7,F5GXS0,F5GXS0 [1429-1443],C4a anaphylatoxin OS=Homo sapiens OX=9606 GN=C4B PE=1 SV=1,F5GXS0; A0A0G2JL54; A0A140TA32; A0A3B3ISA6; P0C0L4-2; A0A0G2JPR0; P0C0L4; A0A140TA29; P0C0L5; A0A140TA44; A0A140TA49,0,1618.83228,7.211,2.85,0.000584542874245558,0.00284302141177137,7.211,High,1330181.83924381,9591678.91797292,92.62,66.71,7,6,2283702.67216836,454971.395394659,5529701.65190574,397987.125,945524.462744054,1330181.83924381,2681370.07097979,8909513.66624171,29803401.6379972,14059773.6839006,6707812.96898693,10326074.7906002,7883387.38511513,111609.015625,298402.40625,457488.125,397987.125,382872.84375,897256.6875,366953.125,1105220.625,1378257.625,1357230.75,2358168.0,672704.0,631427.75,1.0,1.0,1.0,1.0,1.0,1.0,1.0,1.0,1.0,1.0,1.0,1.0,1.0,,2,0.5168,0,1,0.4,0.0009223,0.01755,1.49,100.85,3.199,1.68,0.00349583611113386,0.013229828516472,3.199,High,382872.84375,1224760.96352889,57.52,50.49
410,[AV].EDPQGDAAQKTDT.[S],,False,0.00014485,0.0013942,1,10,6,A0A024R6I7,A0A024R6I7 [25-37],Alpha-1-antitrypsin OS=Homo sapiens OX=9606 GN=SERPINA1 PE=1 SV=1,G3V387; P01009-3; G3V544; A0A024R6I7; A0A0G2JRN3; P01009; G3V5R8; P20848; P01009-2; A0A0B4J278,0,1375.59719,17.312,4.11,0.00191102616224025,0.0070205066381247,17.312,High,674761.913737098,11681250.2855461,111.3,51.4,7,6,7346909.67968014,445695.843785076,3014127.86152302,540956.0625,674761.913737098,561584.067528078,3660900.76077996,12322217.1409083,20585139.6856732,11073624.7116249,3417561.8110223,10220987.9946001,21156910.1259346,359057.84375,292318.84375,249367.46875,540956.0625,273232.5,378809.15625,501004.6875,1528564.75,951959.3125,1068969.125,1201462.375,665858.0,1694583.75,1.0,1.0,1.0,1.0,1.0,1.0,1.0,1.0,1.0,1.0,1.0,1.0,1.0,,2,0.6042,0,1,0.28,0.0004186,4.878e-06,2.83,28.67,3.156,1.66,6.60239783978488e-05,0.00075529759027814,3.156,High,359057.84375,1133281.15828517,30.47,31.91